Target
Glutamate receptor ionotropic, NMDA 3A
Ligand
BDBM50081746
Substrate
Meas. Tech.
ChEBML_143313
IC50
1400±n/a nM
Citation
 Wright, JLGregory, TFBoxer, PAMeltzer, LTSerpa, KAWise, LD Discovery of subtype-selective NMDA receptor ligands: 4-benzyl-1-piperidinylalkynylpyrroles, pyrazoles and imidazoles as NR1A/2B antagonists. Bioorg Med Chem Lett 9:2815-8 (1999)  
Target
Name:
Glutamate receptor ionotropic, NMDA 3A
Synonyms:
Glutamate [NMDA] receptor subunit 3A Grin3a NMDA receptor subunit 3A-1 (GluN3A)
Type:
Protein
Mol. Mass.:
127618.95
Organism:
Rattus norvegicus (Rat)
Description:
Q9R1M7
Residue:
1135
  
Inhibitor
Name:
BDBM50081746
Synonyms:
1-[4-(1H-Imidazol-4-yl)-but-3-ynyl]-4-phenyl-piperidine | CHEMBL96744
Type:
Small organic molecule
Emp. Form.:
C18H21N3
Mol. Mass.:
279.3794
SMILES:
C(CN1CCC(CC1)c1ccccc1)C#Cc1cnc[nH]1
: