Target
Glutamate receptor ionotropic, NMDA 3A
Ligand
BDBM50081742
Substrate
Meas. Tech.
ChEBML_143313
IC50
>100000±n/a nM
Citation
 Wright, JLGregory, TFBoxer, PAMeltzer, LTSerpa, KAWise, LD Discovery of subtype-selective NMDA receptor ligands: 4-benzyl-1-piperidinylalkynylpyrroles, pyrazoles and imidazoles as NR1A/2B antagonists. Bioorg Med Chem Lett 9:2815-8 (1999)  
Target
Name:
Glutamate receptor ionotropic, NMDA 3A
Synonyms:
Glutamate [NMDA] receptor subunit 3A Grin3a NMDA receptor subunit 3A-1 (GluN3A)
Type:
Protein
Mol. Mass.:
127618.95
Organism:
Rattus norvegicus (Rat)
Description:
Q9R1M7
Residue:
1135
  
Inhibitor
Name:
BDBM50081742
Synonyms:
4-Benzyl-1-[4-(1H-imidazol-4-yl)-but-3-ynyl]-piperidin-4-ol | CHEMBL96421
Type:
Small organic molecule
Emp. Form.:
C19H23N3O
Mol. Mass.:
309.4054
SMILES:
OC1(Cc2ccccc2)CCN(CCC#Cc2cnc[nH]2)CC1
: