Target
72 kDa type IV collagenase
Ligand
BDBM50081785
Substrate
Meas. Tech.
ChEBML_101934
IC50
2000±n/a nM
Citation
 Zhang, YLi, DHoutman, JCWitiak, DTSeltzer, JBertics, PJLauhon, CT Design, combinatorial chemical synthesis and in vitro characterization of novel urea based gelatinase inhibitors. Bioorg Med Chem Lett 9:2823-6 (1999)  
Target
Name:
72 kDa type IV collagenase
Synonyms:
72 kDa gelatinase CLG4A Gelatinase A (MMP-2) MMP2_HUMAN Matrix metalloproteinase-2 (MMP 2) Matrix metalloproteinases 2 (MMP-2) | TBE-1
Type:
Enzyme
Mol. Mass.:
73870.36
Organism:
Homo sapiens (Human)
Description:
P08253
Residue:
660
  
Inhibitor
Name:
BDBM50081785
Synonyms:
CHEMBL321087 | N-Hydroxycarbamoylmethyl-2-[3-(4-phenoxy-phenyl)-1-(3-phenyl-propyl)-ureido]-N-(3-phenyl-propyl)-acetamide
Type:
Small organic molecule
Emp. Form.:
C35H38N4O5
Mol. Mass.:
594.7
SMILES:
ONC(=O)CN(CCCc1ccccc1)C(=O)CN(CCCc1ccccc1)C(=O)Nc1ccc(Oc2ccccc2)cc1
: