Target
Proteasome subunit beta type-1
Ligand
BDBM50329819
Substrate
Meas. Tech.
ChEMBL_1901149 (CHEMBL4403371)
IC50
31±n/a nM
Citation
 Xi, JZhuang, RKong, LHe, RZhu, HZhang, J Immunoproteasome-selective inhibitors: An overview of recent developments as potential drugs for hematologic malignancies and autoimmune diseases. Eur J Med Chem 182:0 (2019)  
Target
Name:
Proteasome subunit beta type-1
Synonyms:
PSB1_HUMAN PSMB1 Proteasome subunit beta type-1/beta type-5
Type:
PROTEIN
Mol. Mass.:
26493.62
Organism:
Homo sapiens (Human)
Description:
ChEMBL_1366691
Residue:
241
  
Inhibitor
Name:
BDBM50329819
Synonyms:
(R)-1-((2S,3R)-3-hydroxy-2-(6-phenylpicolinamido)butanamido)-3-methylbutylboronic acid CHEMBL270515 | [(1R)-1-[[(2S,3R)-3-hydroxy-2-[(6-phenylpyridine-2-carbonyl)amino]-1-oxobutyl]amino]-3-methylbutyl]boronic acid
Type:
Small organic molecule
Emp. Form.:
C21H28BN3O5
Mol. Mass.:
413.275
SMILES:
CC(C)C[C@H](NC(=O)[C@@H](NC(=O)c1cccc(n1)-c1ccccc1)[C@@H](C)O)B(O)O
: