Target
5-hydroxytryptamine receptor 3A/3B
Ligand
BDBM50081975
Substrate
Meas. Tech.
ChEMBL_3180 (CHEMBL617708)
IC50
5.4±n/a nM
Citation
 Campiani, GMorelli, EGemma, SNacci, VButini, SHamon, MNovellino, EGreco, GCagnotto, AGoegan, MCervo, LDalla Valle, FFracasso, CCaccia, SMennini, T Pyrroloquinoxaline derivatives as high-affinity and selective 5-HT(3) receptor agonists: synthesis, further structure-activity relationships, and biological studies. J Med Chem 42:4362-79 (1999)  
Target
Name:
5-hydroxytryptamine receptor 3A/3B
Synonyms:
Serotonin 3 (5-HT3) receptor | Serotonin 3a (5-HT3a)/3b (5-HT3b) receptor
Type:
Mol. Mass.:
Description:
ASSAY_ID of EBI is 2974
Components:
This complex has 2 components.
Component 1
Name:
5-hydroxytryptamine receptor 3B
Synonyms:
5HT3B_RAT Serotonin (5-HT) receptor
Type:
PROTEIN
Mol. Mass.:
50328.78
Organism:
Rattus norvegicus
Description:
EBI_11885
Residue:
437
  
Component 2
Name:
5-hydroxytryptamine receptor 3A
Synonyms:
5-HT3 5HT3A_RAT Htr3 Serotonin (5-HT) receptor | Zacopride site-R
Type:
Enzyme Catalytic Domain
Mol. Mass.:
55428.70
Organism:
RAT
Description:
5-HT3 HTR3A RAT::P35563
Residue:
483
  
Inhibitor
Name:
BDBM50081975
Synonyms:
6-(4-Methyl-piperazin-1-yl)-pyrido[3,2-e]pyrrolo[1,2-a]pyrazine | CHEMBL54914
Type:
Small organic molecule
Emp. Form.:
C15H17N5
Mol. Mass.:
267.329
SMILES:
CN1CCN(CC1)c1nc2cccnc2n2cccc12
: