Target
Free fatty acid receptor 3
Ligand
BDBM50527490
Substrate
Meas. Tech.
ChEMBL_1902640 (CHEMBL4404862)
EC50
1072±n/a nM
Citation
 Ulven, ERQuon, TSergeev, EBarki, NBrvar, MHudson, BDDutta, PHansen, AHBielefeldt, LŲTobin, ABMcKenzie, CJMilligan, GUlven, T Structure-Activity Relationship Studies of Tetrahydroquinolone Free Fatty Acid Receptor 3 Modulators. J Med Chem 63:3577-3595 (2020)  
Target
Name:
Free fatty acid receptor 3
Synonyms:
FFAR3 GPR41
Type:
PROTEIN
Mol. Mass.:
38655.15
Organism:
Homo sapiens (Human)
Description:
ChEMBL_1508992
Residue:
346
  
Inhibitor
Name:
BDBM50527490
Synonyms:
CHEMBL4450056
Type:
Small organic molecule
Emp. Form.:
C20H23ClN2O2
Mol. Mass.:
358.862
SMILES:
CCCC1C(C(=O)Nc2cccc(Cl)c2)=C(C)NC2=C1C(=O)CCC2
: