Target
Free fatty acid receptor 3
Ligand
BDBM50527492
Substrate
Meas. Tech.
ChEMBL_1902640 (CHEMBL4404862)
EC50
145±n/a nM
Citation
 Ulven, ERQuon, TSergeev, EBarki, NBrvar, MHudson, BDDutta, PHansen, AHBielefeldt, LŲTobin, ABMcKenzie, CJMilligan, GUlven, T Structure-Activity Relationship Studies of Tetrahydroquinolone Free Fatty Acid Receptor 3 Modulators. J Med Chem 63:3577-3595 (2020)  
Target
Name:
Free fatty acid receptor 3
Synonyms:
FFAR3 GPR41
Type:
PROTEIN
Mol. Mass.:
38655.15
Organism:
Homo sapiens (Human)
Description:
ChEMBL_1508992
Residue:
346
  
Inhibitor
Name:
BDBM50527492
Synonyms:
CHEMBL4436229
Type:
Small organic molecule
Emp. Form.:
C20H22Cl2N2O2
Mol. Mass.:
393.307
SMILES:
CCCC1C(C(=O)Nc2cc(Cl)ccc2Cl)=C(C)NC2=C1C(=O)CCC2
: