Target
Free fatty acid receptor 3
Ligand
BDBM50527494
Substrate
Meas. Tech.
ChEMBL_1902642 (CHEMBL4404864)
EC50
724±n/a nM
Citation
 Ulven, ERQuon, TSergeev, EBarki, NBrvar, MHudson, BDDutta, PHansen, AHBielefeldt, LŲTobin, ABMcKenzie, CJMilligan, GUlven, T Structure-Activity Relationship Studies of Tetrahydroquinolone Free Fatty Acid Receptor 3 Modulators. J Med Chem 63:3577-3595 (2020)  
Target
Name:
Free fatty acid receptor 3
Synonyms:
FFAR3 GPR41
Type:
PROTEIN
Mol. Mass.:
38655.15
Organism:
Homo sapiens (Human)
Description:
ChEMBL_1508992
Residue:
346
  
Inhibitor
Name:
BDBM50527494
Synonyms:
CHEMBL4443269
Type:
Small organic molecule
Emp. Form.:
C26H26N2O2
Mol. Mass.:
398.4968
SMILES:
CC1=C(C(\C=C\c2ccccc2)C2=C(CCCC2=O)N1)C(=O)Nc1ccccc1C
: