Target
Free fatty acid receptor 3
Ligand
BDBM50527464
Substrate
Meas. Tech.
ChEMBL_1902638 (CHEMBL4404860)
EC50
1820±n/a nM
Citation
 Ulven, ERQuon, TSergeev, EBarki, NBrvar, MHudson, BDDutta, PHansen, AHBielefeldt, LŲTobin, ABMcKenzie, CJMilligan, GUlven, T Structure-Activity Relationship Studies of Tetrahydroquinolone Free Fatty Acid Receptor 3 Modulators. J Med Chem 63:3577-3595 (2020)  
Target
Name:
Free fatty acid receptor 3
Synonyms:
FFAR3 GPR41
Type:
PROTEIN
Mol. Mass.:
38655.15
Organism:
Homo sapiens (Human)
Description:
ChEMBL_1508992
Residue:
346
  
Inhibitor
Name:
BDBM50527464
Synonyms:
CHEMBL4564389
Type:
Small organic molecule
Emp. Form.:
C21H18Cl2N2O3
Mol. Mass.:
417.285
SMILES:
CC1=C(C(c2ccco2)C2=C(CCCC2=O)N1)C(=O)Nc1cc(Cl)ccc1Cl
: