Target
Free fatty acid receptor 3
Ligand
BDBM50527508
Substrate
Meas. Tech.
ChEMBL_1902642 (CHEMBL4404864)
EC50
617±n/a nM
Citation
 Ulven, ERQuon, TSergeev, EBarki, NBrvar, MHudson, BDDutta, PHansen, AHBielefeldt, LŲTobin, ABMcKenzie, CJMilligan, GUlven, T Structure-Activity Relationship Studies of Tetrahydroquinolone Free Fatty Acid Receptor 3 Modulators. J Med Chem 63:3577-3595 (2020)  
Target
Name:
Free fatty acid receptor 3
Synonyms:
FFAR3 GPR41
Type:
PROTEIN
Mol. Mass.:
38655.15
Organism:
Homo sapiens (Human)
Description:
ChEMBL_1508992
Residue:
346
  
Inhibitor
Name:
BDBM50527508
Synonyms:
CHEMBL4470725
Type:
Small organic molecule
Emp. Form.:
C16H23NO3
Mol. Mass.:
277.3587
SMILES:
COC(=O)C1=C(C)NC2=C(C1CC(C)C)C(=O)CCC2
: