Target
Free fatty acid receptor 3
Ligand
BDBM50527509
Substrate
Meas. Tech.
ChEMBL_1902640 (CHEMBL4404862)
EC50
1349±n/a nM
Citation
 Ulven, ERQuon, TSergeev, EBarki, NBrvar, MHudson, BDDutta, PHansen, AHBielefeldt, LŲTobin, ABMcKenzie, CJMilligan, GUlven, T Structure-Activity Relationship Studies of Tetrahydroquinolone Free Fatty Acid Receptor 3 Modulators. J Med Chem 63:3577-3595 (2020)  
Target
Name:
Free fatty acid receptor 3
Synonyms:
FFAR3 GPR41
Type:
PROTEIN
Mol. Mass.:
38655.15
Organism:
Homo sapiens (Human)
Description:
ChEMBL_1508992
Residue:
346
  
Inhibitor
Name:
BDBM50527509
Synonyms:
CHEMBL4574477
Type:
Small organic molecule
Emp. Form.:
C24H23BrN2O2
Mol. Mass.:
451.356
SMILES:
CC1=C(C(C2=C(CCCC2=O)N1)c1cccc(Br)c1)C(=O)Nc1ccccc1C
: