Target
Muscarinic acetylcholine receptor M5
Ligand
BDBM50400511
Substrate
Meas. Tech.
ChEMBL_1904416 (CHEMBL4406638)
Ki
2297±n/a nM
Citation
 Moritz, AEFree, RBWeiner, WSAkano, EOGandhi, DAbramyan, AKeck, TMFerrer, MHu, XSouthall, NSteiner, JAubé, JShi, LFrankowski, KJSibley, DR Discovery, Optimization, and Characterization of ML417: A Novel and Highly Selective D J Med Chem 63:5526-5567 (2020)  
Target
Name:
Muscarinic acetylcholine receptor M5
Synonyms:
ACM5_HUMAN | CHRM5
Type:
PROTEIN
Mol. Mass.:
60102.35
Organism:
Homo sapiens (Human)
Description:
ChEMBL_1517990
Residue:
532
  
Inhibitor
Name:
BDBM50400511
Synonyms:
CHEMBL2203406
Type:
Small organic molecule
Emp. Form.:
C27H34N4O2S
Mol. Mass.:
478.649
SMILES:
CCCN(CC[C@]1(O)C[C@@H](C1)NC(=O)c1ccc2ccccc2c1)[C@H]1CCc2nc(N)sc2C1
: