Target
Sigma non-opioid intracellular receptor 1
Ligand
BDBM50527972
Substrate
Meas. Tech.
ChEMBL_1904421 (CHEMBL4406643)
Ki
383±n/a nM
Citation
 Moritz, AEFree, RBWeiner, WSAkano, EOGandhi, DAbramyan, AKeck, TMFerrer, MHu, XSouthall, NSteiner, JAubé, JShi, LFrankowski, KJSibley, DR Discovery, Optimization, and Characterization of ML417: A Novel and Highly Selective D J Med Chem 63:5526-5567 (2020)  
Target
Name:
Sigma non-opioid intracellular receptor 1
Synonyms:
Aging-associated gene 8 protein SGMR1_HUMAN SIGMAR1 SR31747-binding protein Sigma 1-type opioid receptor Sigma1R | hSigmaR1
Type:
Enzyme Catalytic Domain
Mol. Mass.:
25124.85
Organism:
Homo sapiens (Human)
Description:
Q99720
Residue:
223
  
Inhibitor
Name:
BDBM50527972
Synonyms:
CHEMBL4476784 | US11634404, Compound 1
Type:
Small organic molecule
Emp. Form.:
C22H25N3O3
Mol. Mass.:
379.4522
SMILES:
COc1ccc(OCCN2CCN(CC2)C(=O)c2cc3ccccc3[nH]2)cc1
: