Target
Alpha-2A adrenergic receptor
Ligand
BDBM50116766
Substrate
Meas. Tech.
ChEMBL_1904392 (CHEMBL4406614)
Ki
76±n/a nM
Citation
 Moritz, AEFree, RBWeiner, WSAkano, EOGandhi, DAbramyan, AKeck, TMFerrer, MHu, XSouthall, NSteiner, JAubé, JShi, LFrankowski, KJSibley, DR Discovery, Optimization, and Characterization of ML417: A Novel and Highly Selective D J Med Chem 63:5526-5567 (2020)  
Target
Name:
Alpha-2A adrenergic receptor
Synonyms:
ADA2A_HUMAN ADRA2R Adrenergic alpha2A Alpha-2 adrenergic receptor subtype C10 Alpha-2A adrenoreceptor alpha-2A adrenergic receptor [Homo sapiens]
Type:
Enzyme
Mol. Mass.:
48979.91
Organism:
Homo sapiens (Human)
Description:
P08913
Residue:
465
  
Inhibitor
Name:
BDBM50116766
Synonyms:
(-)-Pramipexole 2,6-Benzothiazolediamine, 4,5,6,7-tetrahydro-N(sup 6)-propyl-, (S)- PRAMIPEXOLE | cid_119570
Type:
Small organic molecule
Emp. Form.:
C10H17N3S
Mol. Mass.:
211.327
SMILES:
CCCN[C@H]1CCc2nc(N)sc2C1
: