Target
Alpha-1B adrenergic receptor
Ligand
BDBM50082858
Substrate
Meas. Tech.
ChEMBL_34459 (CHEMBL651991)
Ki
32±n/a nM
Citation
 Lagu, BTian, DNagarathnam, DMarzabadi, MRWong, WCMiao, SWZhang, FSun, WChiu, GFang, JForray, CChang, RSRansom, RWChen, TBO'Malley, SZhang, KVyas, KPGluchowski, C Design and synthesis of novel alpha(1)(a) adrenoceptor-selective antagonists. 3. Approaches to eliminate opioid agonist metabolites by using substituted phenylpiperazine side chains. J Med Chem 42:4794-803 (1999)  
Target
Name:
Alpha-1B adrenergic receptor
Synonyms:
ADA1B_HUMAN Adrenergic alpha1B Adrenergic receptor alpha Alpha 1B-adrenoreceptor | Alpha-1B adrenergic receptor
Type:
Enzyme
Mol. Mass.:
56862.13
Organism:
Homo sapiens (Human)
Description:
P35368
Residue:
520
  
Inhibitor
Name:
BDBM50082858
Synonyms:
3-{3-[4-(2-Carbamoyl-phenyl)-piperazin-1-yl]-propylcarbamoyl}-4-(2,4-difluoro-phenyl)-6-ethyl-2-oxo-1,2,3,4-tetrahydro-pyrimidine-5-carboxylic acid methyl ester | CHEMBL445577
Type:
Small organic molecule
Emp. Form.:
C29H34F2N6O5
Mol. Mass.:
584.6143
SMILES:
CCC1=C(C(N(C(=O)NCCCN2CCN(CC2)c2ccccc2C(N)=O)C(=O)N1)c1ccc(F)cc1F)C(=O)OC
: