Target
Alpha-1D adrenergic receptor
Ligand
BDBM50082858
Substrate
Meas. Tech.
ChEMBL_32453 (CHEMBL643401)
Ki
91±n/a nM
Citation
 Lagu, BTian, DNagarathnam, DMarzabadi, MRWong, WCMiao, SWZhang, FSun, WChiu, GFang, JForray, CChang, RSRansom, RWChen, TBO'Malley, SZhang, KVyas, KPGluchowski, C Design and synthesis of novel alpha(1)(a) adrenoceptor-selective antagonists. 3. Approaches to eliminate opioid agonist metabolites by using substituted phenylpiperazine side chains. J Med Chem 42:4794-803 (1999)  
Target
Name:
Alpha-1D adrenergic receptor
Synonyms:
ADA1D_HUMAN ADRA1D Adrenergic receptor alpha Alpha 1D-adrenoreceptor Alpha-1D adrenoceptor adrenergic Alpha1D
Type:
Enzyme Catalytic Domain
Mol. Mass.:
60485.82
Organism:
Homo sapiens (Human)
Description:
adrenergic Alpha1D ADRA1D HUMAN::P25100
Residue:
572
  
Inhibitor
Name:
BDBM50082858
Synonyms:
3-{3-[4-(2-Carbamoyl-phenyl)-piperazin-1-yl]-propylcarbamoyl}-4-(2,4-difluoro-phenyl)-6-ethyl-2-oxo-1,2,3,4-tetrahydro-pyrimidine-5-carboxylic acid methyl ester | CHEMBL445577
Type:
Small organic molecule
Emp. Form.:
C29H34F2N6O5
Mol. Mass.:
584.6143
SMILES:
CCC1=C(C(N(C(=O)NCCCN2CCN(CC2)c2ccccc2C(N)=O)C(=O)N1)c1ccc(F)cc1F)C(=O)OC
: