Target
Cyclin-dependent kinase 4
Ligand
BDBM50528239
Substrate
Meas. Tech.
ChEMBL_1904670 (CHEMBL4407028)
IC50
0.080000±n/a nM
Citation
 Khan, IShareef, MAKumar, CG An overview on the synthetic and medicinal perspectives of indenopyrazoles. Eur J Med Chem 178:1-12 (2019)  
Target
Name:
Cyclin-dependent kinase 4
Synonyms:
CDK4 Cell division protein kinase 4 PSK-J3
Type:
Enzyme Subunit
Mol. Mass.:
33731.96
Organism:
Homo sapiens (Human)
Description:
P11802
Residue:
303
  
Inhibitor
Name:
BDBM50528239
Synonyms:
CHEMBL148580
Type:
Small organic molecule
Emp. Form.:
C24H25N7O3
Mol. Mass.:
459.5004
SMILES:
COc1ccc(cc1)-c1[nH]nc2-c3cccc(NC(=O)CN4CCN(CC4)C(N)=N)c3C(=O)c12
: