Target
5-hydroxytryptamine receptor 1A
Ligand
BDBM82517
Substrate
Meas. Tech.
ChEMBL_1302 (CHEMBL616679)
Ki
0.55±n/a nM
Citation
 Paluchowska, MHMokrosz, MJBojarski, AWesolowska, ABorycz, JCharakchieva-Minol, SChojnacka-Wójcik, E On the bioactive conformation of NAN-190 (1) and MP3022 (2), 5-HT(1A) receptor antagonists. J Med Chem 42:4952-60 (2000)  
Target
Name:
5-hydroxytryptamine receptor 1A
Synonyms:
5-HT-1A 5-HT1A 5-hydroxytryptamine receptor 1A (5HT1A) 5ht1a Htr1a Serotonin 1a (5-HT1a) receptor/Adrenergic receptor alpha-1 | Serotonin receptor 1A
Type:
G Protein-Coupled Receptor (GPCR)
Mol. Mass.:
46445.29
Organism:
Rattus norvegicus (rat)
Description:
Binding assays were performed using rat hippocampal membranes.
Residue:
422
  
Inhibitor
Name:
BDBM82517
Synonyms:
2-{4-[4-(2-Methoxy-phenyl)-piperazin-1-yl]-butyl}-isoindole-1,3-dione CHEMBL126632 NAN-190 | NSC_107966
Type:
Small organic molecule
Emp. Form.:
C23H27N3O3
Mol. Mass.:
393.4788
SMILES:
COc1ccccc1N1CCN(CCCCN2C(=O)c3ccccc3C2=O)CC1
: