Target
5-hydroxytryptamine receptor 3A
Ligand
BDBM50528722
Substrate
Meas. Tech.
ChEMBL_1906158 (CHEMBL4408516)
IC50
710±n/a nM
Citation
 Xue, YHe, XYang, TWang, YLiu, ZZhang, GWang, YWang, KZhang, LZhang, L Discovery of fused heterocyclic carboxamide derivatives as novel ?7-nAChR agonists: Synthesis, preliminary SAR and biological evaluation. Eur J Med Chem 182:0 (2019)  
Target
Name:
5-hydroxytryptamine receptor 3A
Synonyms:
5-HT-3 5-HT3A 5-hydroxytryptamine receptor 3 (5-HT3) 5-hydroxytryptamine receptor 3A (5HT3A) 5HT3R HTR3A Serotonin 3 receptor (5HT3) Serotonin-gated ion channel receptor | Serotonin-gated ion channel receptor 3
Type:
Protein
Mol. Mass.:
55283.27
Organism:
Homo sapiens (Human)
Description:
P46098
Residue:
478
  
Inhibitor
Name:
BDBM50528722
Synonyms:
CHEMBL4453847
Type:
Small organic molecule
Emp. Form.:
C20H21N3O
Mol. Mass.:
319.4002
SMILES:
O=C(N[C@H]1CN2CCC1CC2)c1cc2ccc3ccccc3n2c1
: