Target
Neuronal acetylcholine receptor subunit alpha-4/beta-2
Ligand
BDBM50528722
Substrate
Meas. Tech.
ChEMBL_1906160 (CHEMBL4408518)
EC50
6140±n/a nM
Citation
 Xue, YHe, XYang, TWang, YLiu, ZZhang, GWang, YWang, KZhang, LZhang, L Discovery of fused heterocyclic carboxamide derivatives as novel ?7-nAChR agonists: Synthesis, preliminary SAR and biological evaluation. Eur J Med Chem 182:0 (2019)  
Target
Name:
Neuronal acetylcholine receptor subunit alpha-4/beta-2
Synonyms:
Neuronal acetylcholine receptor Alpha-4/Beta-2 Neuronal acetylcholine receptor; alpha4/beta2 | nAChR subtypes alpha4 beta2
Type:
Protein
Mol. Mass.:
Description:
Components:
This complex has 2 components.
Component 1
Name:
Neuronal acetylcholine receptor subunit alpha-4
Synonyms:
ACHA4_HUMAN CHRNA4 protein Neuronal acetylcholine receptor protein alpha-4 subunit Nicotinic acetylcholine receptor alpha4/beta2/alpha5
Type:
Mol. Mass.:
69963.49
Organism:
Homo sapiens (Human)
Description:
NACHRA4
Residue:
627
  
Component 2
Name:
Neuronal acetylcholine receptor subunit beta-2
Synonyms:
ACHB2_HUMAN Neuronal acetylcholine receptor protein beta-2 subunit | Nicotinic acetylcholine receptor alpha3/beta2/alpha5
Type:
Protein
Mol. Mass.:
57020.50
Organism:
Homo sapiens (Human)
Description:
P17787
Residue:
502
  
Inhibitor
Name:
BDBM50528722
Synonyms:
CHEMBL4453847
Type:
Small organic molecule
Emp. Form.:
C20H21N3O
Mol. Mass.:
319.4002
SMILES:
O=C(N[C@H]1CN2CCC1CC2)c1cc2ccc3ccccc3n2c1
: