Target
Neuronal acetylcholine receptor subunit alpha-7
Ligand
BDBM50528724
Substrate
Meas. Tech.
ChEMBL_1906146 (CHEMBL4408504)
EC50
3200±n/a nM
Citation
 Xue, YHe, XYang, TWang, YLiu, ZZhang, GWang, YWang, KZhang, LZhang, L Discovery of fused heterocyclic carboxamide derivatives as novel ?7-nAChR agonists: Synthesis, preliminary SAR and biological evaluation. Eur J Med Chem 182:0 (2019)  
Target
Name:
Neuronal acetylcholine receptor subunit alpha-7
Synonyms:
ACHA7_HUMAN Cholinergic, Nicotinic Alpha7 Neuronal acetylcholine receptor protein alpha-7 subunit Nicotinic acetylcholine receptor alpha-7 (alpha7 nAChR)
Type:
Mol. Mass.:
56448.33
Organism:
Homo sapiens (Human)
Description:
CHRNA7 (NACHRA7)
Residue:
502
  
Inhibitor
Name:
BDBM50528724
Synonyms:
CHEMBL4473334
Type:
Small organic molecule
Emp. Form.:
C27H27N3O
Mol. Mass.:
409.5228
SMILES:
Cc1ccccc1-c1ccc2c(ccc3cc(cn23)C(=O)N[C@H]2CN3CCC2CC3)c1
: