Target
Adenosine receptor A3
Ligand
BDBM50059375
Substrate
Meas. Tech.
ChEBML_31409
Ki
18±n/a nM
Citation
 Webb, TRMelman, NLvovskiy, DJi, XDJacobson, KA The utilization of a unified pharmacophore query in the discovery of new antagonists of the adenosine receptor family. Bioorg Med Chem Lett 10:31-4 (2000)  
Target
Name:
Adenosine receptor A3
Synonyms:
A3 adenosine receptor (hA3) ADORA3 | Adenosine A3 receptor (A3AR)
Type:
G Protein-Coupled Receptor (GPCR)
Mol. Mass.:
36197.32
Organism:
Homo sapiens (Human)
Description:
P0DMS8
Residue:
318
  
Inhibitor
Name:
BDBM50059375
Synonyms:
5-Amino-3-(4-methoxy-phenyl)-thiazolo[3,2-a]pyrimidin-7-one | CHEMBL89472
Type:
Small organic molecule
Emp. Form.:
C13H11N3O2S
Mol. Mass.:
273.31
SMILES:
COc1ccc(cc1)-c1csc2nc(=O)cc(N)n12
: