Target
Potassium voltage-gated channel subfamily KQT member 2
Ligand
BDBM50529213
Substrate
Meas. Tech.
ChEMBL_1908031 (CHEMBL4410389)
IC50
160±n/a nM
Citation
 Porter, JDVivas, OWeaver, CDAlsafran, ADiMilo, EArnold, LADickson, EJDockendorff, C An anthrone-based Kv7.2/7.3 channel blocker with improved properties for the investigation of psychiatric and neurodegenerative disorders. Bioorg Med Chem Lett 29:0 (2019)  
Target
Name:
Potassium voltage-gated channel subfamily KQT member 2
Synonyms:
KCNQ (Kv7) potassium channel KCNQ2_HUMAN Neuroblastoma-specific potassium channel subunit alpha KvLQT2 Voltage-gated potassium channel subunit Kv7.2
Type:
PROTEIN
Mol. Mass.:
95883.20
Organism:
Homo sapiens (Human)
Description:
ChEMBL_1457496
Residue:
872
  
Inhibitor
Name:
BDBM50529213
Synonyms:
CHEMBL4465132
Type:
Small organic molecule
Emp. Form.:
C25H17F2N3O
Mol. Mass.:
413.4188
SMILES:
Fc1cncc(F)c1CC1(Cc2ccnnc2)c2ccccc2C(=O)c2ccccc12
: