Target
Kappa-type opioid receptor
Ligand
BDBM50529503
Substrate
Meas. Tech.
ChEMBL_1908762 (CHEMBL4411120)
Ki
0.316228±n/a nM
Citation
 Long, DDArmstrong, SRBeattie, DTCampbell, CBChurch, TJColson, PJDalziel, SMJacobsen, JRJiang, LObedencio, GPRapta, MSaito, DStergiades, ITsuruda, PRVan Dyke, PMVickery, RG Discovery of Axelopran (TD-1211): A Peripherally Restricted ?-Opioid Receptor Antagonist. ACS Med Chem Lett 10:1641-1647 (2019)  
Target
Name:
Kappa-type opioid receptor
Synonyms:
Kappa Opioid Receptor OPRK1 Opiate Kappa 1 | mu/kappa opioid receptor
Type:
G Protein-Coupled Receptor (GPCR)
Mol. Mass.:
42744.99
Organism:
Cavia porcellus (domestic guinea pig)
Description:
P41144
Residue:
380
  
Inhibitor
Name:
BDBM50529503
Synonyms:
CHEMBL3990213
Type:
Small organic molecule
Emp. Form.:
C24H35N3O3
Mol. Mass.:
413.553
SMILES:
NC(=O)c1cccc(c1)[C@@H]1C[C@@H]2CC[C@H](C1)N2CCN(CC1CCCC1)C(=O)CO
: