Target
Kappa-type opioid receptor
Ligand
BDBM50045758
Substrate
Meas. Tech.
ChEMBL_1908762 (CHEMBL4411120)
Ki
0.794328±n/a nM
Citation
 Long, DDArmstrong, SRBeattie, DTCampbell, CBChurch, TJColson, PJDalziel, SMJacobsen, JRJiang, LObedencio, GPRapta, MSaito, DStergiades, ITsuruda, PRVan Dyke, PMVickery, RG Discovery of Axelopran (TD-1211): A Peripherally Restricted ?-Opioid Receptor Antagonist. ACS Med Chem Lett 10:1641-1647 (2019)  
Target
Name:
Kappa-type opioid receptor
Synonyms:
Kappa Opioid Receptor OPRK1 Opiate Kappa 1 | mu/kappa opioid receptor
Type:
G Protein-Coupled Receptor (GPCR)
Mol. Mass.:
42744.99
Organism:
Cavia porcellus (domestic guinea pig)
Description:
P41144
Residue:
380
  
Inhibitor
Name:
BDBM50045758
Synonyms:
3-[3,4-Dimethyl-1-(3-phenyl-propyl)-piperidin-4-yl]-phenol | CHEMBL320218
Type:
Small organic molecule
Emp. Form.:
C22H29NO
Mol. Mass.:
323.4718
SMILES:
C[C@H]1CN(CCCc2ccccc2)CC[C@@]1(C)c1cccc(O)c1
: