Target
Carbonic anhydrase 2
Ligand
BDBM50079068
Substrate
Meas. Tech.
ChEMBL_45075 (CHEMBL657146)
Ki
3±n/a nM
Citation
 Scozzafava, ABriganti, FIlies, MASupuran, CT Carbonic anhydrase inhibitors: synthesis of membrane-impermeant low molecular weight sulfonamides possessing in vivo selectivity for the membrane-bound versus cytosolic isozymes. J Med Chem 43:292-300 (2000)  
Target
Name:
Carbonic anhydrase 2
Synonyms:
CA-II CAC Carbonate dehydratase II Carbonic anhydrase 2 (CA-II) Carbonic anhydrase C Carbonic anhydrase II (CA-II) Carbonic anhydrase II (hCA II) | Carbonic anhydrase isoenzyme II (hCA II)
Type:
Enzyme
Mol. Mass.:
29250.71
Organism:
Homo sapiens (Human)
Description:
P00918
Residue:
260
  
Inhibitor
Name:
BDBM50079068
Synonyms:
3-amino-N-(5-sulfamoyl-[1,3,4]thiadiazol-2-yl)-propionamide | CHEMBL13646
Type:
Small organic molecule
Emp. Form.:
C5H9N5O3S2
Mol. Mass.:
251.287
SMILES:
NCCC(=O)Nc1nnc(s1)S(N)(=O)=O
: