Target
Non-receptor tyrosine-protein kinase TYK2
Ligand
BDBM50529609
Substrate
Meas. Tech.
ChEMBL_1909147 (CHEMBL4411593)
IC50
53±n/a nM
Citation
 Fensome, AAmbler, CMArnold, EBanker, MEBrown, MFChrencik, JClark, JDDowty, MEEfremov, IVFlick, AGerstenberger, BSGopalsamy, AHayward, MMHegen, MHollingshead, BDJussif, JKnafels, JDLimburg, DCLin, DLin, THPierce, BSSaiah, ESharma, RSymanowicz, PTTelliez, JBTrujillo, JIVajdos, FFVincent, FWan, ZKXing, LYang, XYang, XZhang, L Dual Inhibition of TYK2 and JAK1 for the Treatment of Autoimmune Diseases: Discovery of (( S)-2,2-Difluorocyclopropyl)((1 R,5 S)-3-(2-((1-methyl-1 H-pyrazol-4-yl)amino)pyrimidin-4-yl)-3,8-diazabicyclo[3.2.1]octan-8-yl)methanone (PF-06700841). J Med Chem 61:8597-8612 (2018)  
Target
Name:
Non-receptor tyrosine-protein kinase TYK2
Synonyms:
Non-receptor tyrosine-protein kinase TYK2 (TYK2) TYK2_HUMAN | Tyrosine-protein kinase TYK2
Type:
Protein
Mol. Mass.:
133666.03
Organism:
Homo sapiens (Human)
Description:
P29597
Residue:
1187
  
Inhibitor
Name:
BDBM50529609
Synonyms:
CHEMBL4580985
Type:
Small organic molecule
Emp. Form.:
C18H22FN7O
Mol. Mass.:
371.412
SMILES:
[H][C@]12CC[C@]([H])(CN(C1)c1nc(Nc3cnn(C)c3)ncc1F)N2C(=O)C1CC1
: