Target
Tyrosine-protein kinase JAK1
Ligand
BDBM329926
Substrate
Meas. Tech.
ChEMBL_1909148 (CHEMBL4411594)
IC50
63±n/a nM
Citation
 Fensome, AAmbler, CMArnold, EBanker, MEBrown, MFChrencik, JClark, JDDowty, MEEfremov, IVFlick, AGerstenberger, BSGopalsamy, AHayward, MMHegen, MHollingshead, BDJussif, JKnafels, JDLimburg, DCLin, DLin, THPierce, BSSaiah, ESharma, RSymanowicz, PTTelliez, JBTrujillo, JIVajdos, FFVincent, FWan, ZKXing, LYang, XYang, XZhang, L Dual Inhibition of TYK2 and JAK1 for the Treatment of Autoimmune Diseases: Discovery of (( S)-2,2-Difluorocyclopropyl)((1 R,5 S)-3-(2-((1-methyl-1 H-pyrazol-4-yl)amino)pyrimidin-4-yl)-3,8-diazabicyclo[3.2.1]octan-8-yl)methanone (PF-06700841). J Med Chem 61:8597-8612 (2018)  
Target
Name:
Tyrosine-protein kinase JAK1
Synonyms:
JAK-1 JAK1A JAK1_HUMAN Janus kinase 1 (JAK1) | Janus kinase 1 JAK1
Type:
Protein
Mol. Mass.:
133293.73
Organism:
Homo sapiens (Human)
Description:
P23458
Residue:
1154
  
Inhibitor
Name:
BDBM329926
Synonyms:
US10463675, Example 9 US11197867, Example 9 | US9663526, Example 9
Type:
Small organic molecule
Emp. Form.:
C23H27FN6O2
Mol. Mass.:
438.4979
SMILES:
CCNC(=O)c1ccc(Nc2ncc(F)c(n2)N2C[C@@H]3CC[C@H](C2)N3C(=O)C2CC2)cc1
: