Target
Discoidin domain-containing receptor 2
Ligand
BDBM50529786
Substrate
Meas. Tech.
ChEMBL_1909870 (CHEMBL4412316)
IC50
3.7±n/a nM
Citation
 Wang, QDai, YJi, YShi, HGuo, ZChen, DChen, YPeng, XGao, YWang, XChen, LJiang, YGeng, MShen, JAi, JXiong, B Discovery and optimization of a series of 3-substituted indazole derivatives as multi-target kinase inhibitors for the treatment of lung squamous cell carcinoma. Eur J Med Chem 163:671-689 (2019)  
Target
Name:
Discoidin domain-containing receptor 2
Synonyms:
DDR2 Discoidin domain receptor 2 (DDR2) Discoidin domain-containing receptor 2 (DDR2) NTRKR3 TYRO10
Type:
Protein
Mol. Mass.:
96717.07
Organism:
Homo sapiens (Human)
Description:
Q16832
Residue:
855
  
Inhibitor
Name:
BDBM50529786
Synonyms:
CHEMBL4458216
Type:
Small organic molecule
Emp. Form.:
C28H24F3N5O2
Mol. Mass.:
519.5177
SMILES:
CC(O)Cn1cc(cn1)-c1n[nH]c2cc(ccc12)-c1cc(ccc1C)C(=O)Nc1cccc(c1)C(F)(F)F
: