Target
Phosphatidylcholine:ceramide cholinephosphotransferase 2
Ligand
BDBM50529822
Substrate
Meas. Tech.
ChEMBL_1910274 (CHEMBL4412720)
IC50
670±n/a nM
Citation
 Li, YHuang, TLou, BYe, DQi, XLi, XHu, SDing, TChen, YCao, YMo, MDong, JWei, MChu, YLi, HJiang, XCCheng, NZhou, L Discovery, synthesis and anti-atherosclerotic activities of a novel selective sphingomyelin synthase 2 inhibitor. Eur J Med Chem 163:864-882 (2019)  
Target
Name:
Phosphatidylcholine:ceramide cholinephosphotransferase 2
Synonyms:
SGMS2 SMS2_HUMAN | Sphingomyelin synthase 2
Type:
PROTEIN
Mol. Mass.:
42294.80
Organism:
Homo sapiens (Human)
Description:
ChEMBL_108027
Residue:
365
  
Inhibitor
Name:
BDBM50529822
Synonyms:
CHEMBL4558411
Type:
Small organic molecule
Emp. Form.:
C24H25ClN2O3
Mol. Mass.:
424.92
SMILES:
ClCCCCCOc1ccccc1COc1ccccc1C(=O)Nc1cccnc1
: