Target
Phosphatidylcholine:ceramide cholinephosphotransferase 2
Ligand
BDBM50529843
Substrate
Meas. Tech.
ChEMBL_1910274 (CHEMBL4412720)
IC50
740±n/a nM
Citation
 Li, YHuang, TLou, BYe, DQi, XLi, XHu, SDing, TChen, YCao, YMo, MDong, JWei, MChu, YLi, HJiang, XCCheng, NZhou, L Discovery, synthesis and anti-atherosclerotic activities of a novel selective sphingomyelin synthase 2 inhibitor. Eur J Med Chem 163:864-882 (2019)  
Target
Name:
Phosphatidylcholine:ceramide cholinephosphotransferase 2
Synonyms:
SGMS2 SMS2_HUMAN | Sphingomyelin synthase 2
Type:
PROTEIN
Mol. Mass.:
42294.80
Organism:
Homo sapiens (Human)
Description:
ChEMBL_108027
Residue:
365
  
Inhibitor
Name:
BDBM50529843
Synonyms:
CHEMBL4462317
Type:
Small organic molecule
Emp. Form.:
C19H14ClFN2O2
Mol. Mass.:
356.778
SMILES:
Fc1ccc(Cl)c(COc2ccccc2C(=O)Nc2cccnc2)c1
: