Target
Cytochrome P450 1A2
Ligand
BDBM50105834
Substrate
Meas. Tech.
ChEMBL_1911028 (CHEMBL4413474)
IC50
<700±n/a nM
Citation
 Graziani, DCaligari, SCallegari, EDe Toma, CLonghi, MFrigerio, FDilernia, RMenegon, SPinzi, LPirona, LTazzari, VValsecchi, AEVistoli, GRastelli, GRiva, C Evaluation of Amides, Carbamates, Sulfonamides, and Ureas of 4-Prop-2-ynylidenecycloalkylamine as Potent, Selective, and Bioavailable Negative Allosteric Modulators of Metabotropic Glutamate Receptor 5. J Med Chem 62:1246-1273 (2019)  
Target
Name:
Cytochrome P450 1A2
Synonyms:
CP1A2_HUMAN CYPIA2 Cytochrome P(3)450 Cytochrome P450 1A2 (CYP1A2) Cytochrome P450-P3
Type:
Enzyme
Mol. Mass.:
58423.38
Organism:
Homo sapiens (Human)
Description:
P05177
Residue:
516
  
Inhibitor
Name:
BDBM50105834
Synonyms:
CHEMBL3597594
Type:
Small organic molecule
Emp. Form.:
C19H18N4O2
Mol. Mass.:
334.3718
SMILES:
[#6]-c1cccc(n1)C#C\[#6]=[#6]-1/[#6]-[#6]-[#7](-[#6]-[#6]-1)-c1ncccc1-[#7+](-[#8-])=O
: