Target
Cathepsin G
Ligand
BDBM50085339
Substrate
Meas. Tech.
ChEBML_45352
IC50
24000±n/a nM
Citation
 Hayashi, YIijima, KKatada, JKiso, Y Structure-activity relationship studies of chloromethyl ketone derivatives for selective human chymase inhibitors. Bioorg Med Chem Lett 10:199-201 (2000)  
Target
Name:
Cathepsin G
Synonyms:
CATG_HUMAN CTSG
Type:
PROTEIN
Mol. Mass.:
28860.08
Organism:
Homo sapiens (Human)
Description:
ChEMBL_1469016
Residue:
255
  
Inhibitor
Name:
BDBM50085339
Synonyms:
((S)-1-Benzyl-3-chloro-2-oxo-propyl)-carbamic acid benzyl ester acs.jmedchem.1c00409_ST.138
Type:
Small organic molecule
Emp. Form.:
C18H18ClNO3
Mol. Mass.:
331.793
SMILES:
ClCC(=O)[C@H](Cc1ccccc1)NC(=O)OCc1ccccc1
: