Target
Casein kinase II subunit alpha
Ligand
BDBM50530315
Substrate
Meas. Tech.
ChEMBL_1911699 (CHEMBL4414145)
IC50
600±n/a nM
Citation
 Bestgen, BKufareva, ISeetoh, WAbell, CHartmann, RWAbagyan, RLe Borgne, MFilhol, OCochet, CLomberget, TEngel, M 2-Aminothiazole Derivatives as Selective Allosteric Modulators of the Protein Kinase CK2. 2. Structure-Based Optimization and Investigation of Effects Specific to the Allosteric Mode of Action. J Med Chem 62:1817-1836 (2019)  
Target
Name:
Casein kinase II subunit alpha
Synonyms:
CK II CK2- alpha CSK21_HUMAN Casein kinase 2 Casein kinase II alpha/beta Casein kinase II subunit alpha (CK2A1) Casein kinase II subunit alpha (CK2a V66A) Casein kinase II subunit alpha (CK2a)
Type:
Enzyme
Mol. Mass.:
45151.12
Organism:
Homo sapiens (Human)
Description:
P68400
Residue:
391
  
Inhibitor
Name:
BDBM50530315
Synonyms:
CHEMBL4520531
Type:
Small organic molecule
Emp. Form.:
C20H14N2O3S
Mol. Mass.:
362.402
SMILES:
OC(=O)c1ccc(Nc2nc(cs2)-c2ccc3ccccc3c2)cc1O
: