Target
Casein kinase II subunit alpha
Ligand
BDBM50530327
Substrate
Meas. Tech.
ChEMBL_1911714 (CHEMBL4414160)
IC50
6000±n/a nM
Citation
 Bestgen, BKufareva, ISeetoh, WAbell, CHartmann, RWAbagyan, RLe Borgne, MFilhol, OCochet, CLomberget, TEngel, M 2-Aminothiazole Derivatives as Selective Allosteric Modulators of the Protein Kinase CK2. 2. Structure-Based Optimization and Investigation of Effects Specific to the Allosteric Mode of Action. J Med Chem 62:1817-1836 (2019)  
Target
Name:
Casein kinase II subunit alpha
Synonyms:
CK II CK2- alpha CSK21_HUMAN Casein kinase 2 Casein kinase II alpha/beta Casein kinase II subunit alpha (CK2A1) Casein kinase II subunit alpha (CK2a V66A) Casein kinase II subunit alpha (CK2a)
Type:
Enzyme
Mol. Mass.:
45151.12
Organism:
Homo sapiens (Human)
Description:
P68400
Residue:
391
  
Inhibitor
Name:
BDBM50530327
Synonyms:
CHEMBL4449524
Type:
Small organic molecule
Emp. Form.:
C17H14N2O3S
Mol. Mass.:
326.37
SMILES:
COc1ccc(cc1)-c1csc(Nc2ccc(cc2)C(O)=O)n1
: