Target
Casein kinase II subunit alpha
Ligand
BDBM50530334
Substrate
Meas. Tech.
ChEMBL_1911714 (CHEMBL4414160)
IC50
5000±n/a nM
Citation
 Bestgen, BKufareva, ISeetoh, WAbell, CHartmann, RWAbagyan, RLe Borgne, MFilhol, OCochet, CLomberget, TEngel, M 2-Aminothiazole Derivatives as Selective Allosteric Modulators of the Protein Kinase CK2. 2. Structure-Based Optimization and Investigation of Effects Specific to the Allosteric Mode of Action. J Med Chem 62:1817-1836 (2019)  
Target
Name:
Casein kinase II subunit alpha
Synonyms:
CK II CK2- alpha CSK21_HUMAN Casein kinase 2 Casein kinase II alpha/beta Casein kinase II subunit alpha (CK2A1) Casein kinase II subunit alpha (CK2a V66A) Casein kinase II subunit alpha (CK2a)
Type:
Enzyme
Mol. Mass.:
45151.12
Organism:
Homo sapiens (Human)
Description:
P68400
Residue:
391
  
Inhibitor
Name:
BDBM50530334
Synonyms:
CHEMBL4476631
Type:
Small organic molecule
Emp. Form.:
C14H10N2O2S2
Mol. Mass.:
302.371
SMILES:
OC(=O)c1ccc(Nc2nc(cs2)-c2ccsc2)cc1
: