Target
Casein kinase II subunit beta
Ligand
BDBM50335638
Substrate
Meas. Tech.
ChEMBL_1911741 (CHEMBL4414187)
IC50
2000±n/a nM
Citation
 Bestgen, BKufareva, ISeetoh, WAbell, CHartmann, RWAbagyan, RLe Borgne, MFilhol, OCochet, CLomberget, TEngel, M 2-Aminothiazole Derivatives as Selective Allosteric Modulators of the Protein Kinase CK2. 2. Structure-Based Optimization and Investigation of Effects Specific to the Allosteric Mode of Action. J Med Chem 62:1817-1836 (2019)  
Target
Name:
Casein kinase II subunit beta
Synonyms:
CK2N CSNK2B Casein kinase II subunit beta (CK2 beta) G5A | Serine/threonine-protein kinase pim-2
Type:
Enzyme
Mol. Mass.:
24937.13
Organism:
Homo sapiens (Human)
Description:
P67870
Residue:
215
  
Inhibitor
Name:
BDBM50335638
Synonyms:
5-(3-Chlorophenylamino)benzo[c][2,6]naphthyridine-8-carboxylic acid CHEMBL1230165 US9062043, Table 13, Compound 17 | US9062043, Table 20b, Compound 12
Type:
Small organic molecule
Emp. Form.:
C19H12ClN3O2
Mol. Mass.:
349.77
SMILES:
OC(=O)c1ccc2c(c1)nc(Nc1cccc(Cl)c1)c1ccncc21
: