Target
Dual specificity tyrosine-phosphorylation-regulated kinase 1B
Ligand
BDBM50335638
Substrate
Meas. Tech.
ChEMBL_1911830 (CHEMBL4414276)
IC50
6.4±n/a nM
Citation
 Bestgen, BKrimm, IKufareva, IKamal, AAMSeetoh, WGAbell, CHartmann, RWAbagyan, RCochet, CLe Borgne, MEngel, MLomberget, T 2-Aminothiazole Derivatives as Selective Allosteric Modulators of the Protein Kinase CK2. 1. Identification of an Allosteric Binding Site. J Med Chem 62:1803-1816 (2019)  
Target
Name:
Dual specificity tyrosine-phosphorylation-regulated kinase 1B
Synonyms:
DYR1B_HUMAN Dual specificity tyrosine-phosphorylation-regulated kinase 1B MIRK
Type:
Enzyme
Mol. Mass.:
69222.24
Organism:
Homo sapiens (Human)
Description:
Q9Y463
Residue:
629
  
Inhibitor
Name:
BDBM50335638
Synonyms:
5-(3-Chlorophenylamino)benzo[c][2,6]naphthyridine-8-carboxylic acid CHEMBL1230165 US9062043, Table 13, Compound 17 | US9062043, Table 20b, Compound 12
Type:
Small organic molecule
Emp. Form.:
C19H12ClN3O2
Mol. Mass.:
349.77
SMILES:
OC(=O)c1ccc2c(c1)nc(Nc1cccc(Cl)c1)c1ccncc21
: