Target
Non-receptor tyrosine-protein kinase TYK2 [5-1181]
Ligand
BDBM50519523
Substrate
Meas. Tech.
ChEMBL_1912217 (CHEMBL4414800)
IC50
120±n/a nM
Target
Name:
Non-receptor tyrosine-protein kinase TYK2 [5-1181]
Synonyms:
Non-receptor tyrosine-protein kinase TYK2 Tyk2
Type:
PROTEIN
Mol. Mass.:
132654.63
Organism:
Mus musculus
Description:
ChEMBL_105608
Residue:
1177
  
Inhibitor
Name:
BDBM50519523
Synonyms:
CHEMBL4440718
Type:
Small organic molecule
Emp. Form.:
C18H18N6O3S
Mol. Mass.:
401.457
SMILES:
[2H]C([2H])([2H])NC(=O)c1nnc(Nc2ccccn2)cc1Nc1ccccc1S(C)(=O)=O
: