Target
Alpha-2B adrenergic receptor
Ligand
BDBM50085677
Substrate
Meas. Tech.
ChEMBL_33358 (CHEMBL644762)
Ki
100±n/a nM
Citation
 Ross, TMJetter, MCMcDonnell, MEBoyd, REConnelly, CDMartinez, RPLewis, MACodd, EERaffa, RBReitz, AB alpha(2) Adrenoceptor agonists as potential analgesic agents. 2. Discovery of 4-(4-Imidazo)-1,3-dimethyl-6,7-dihydrothianaphthene [corrected] as a high-affinity ligand for the alpha(2D) adrenergic receptor. J Med Chem 43:765-8 (2000)  
Target
Name:
Alpha-2B adrenergic receptor
Synonyms:
ADA2B_HUMAN ADRA2L1 Adrenergic alpha2B Adrenergic receptor alpha Alpha-2 adrenergic receptor subtype C2 Alpha-2B adrenoreceptor | Alpha-2BAR
Type:
Enzyme
Mol. Mass.:
49964.20
Organism:
Homo sapiens (Human)
Description:
P18089
Residue:
450
  
Inhibitor
Name:
BDBM50085677
Synonyms:
4-(1,3-Dimethyl-6,7-dihydro-benzo[c]thiophen-4-yl)-1H-imidazole | CHEMBL284795
Type:
Small organic molecule
Emp. Form.:
C13H14N2S
Mol. Mass.:
230.329
SMILES:
Cc1sc(C)c2c1CCC=C2c1cnc[nH]1
: