Target
Alpha-1A/Alpha-1B/Alpha-1D adrenergic receptor
Ligand
BDBM50085676
Substrate
Meas. Tech.
ChEMBL_32551 (CHEMBL645686)
Ki
48±n/a nM
Citation
 Ross, TMJetter, MCMcDonnell, MEBoyd, REConnelly, CDMartinez, RPLewis, MACodd, EERaffa, RBReitz, AB alpha(2) Adrenoceptor agonists as potential analgesic agents. 2. Discovery of 4-(4-Imidazo)-1,3-dimethyl-6,7-dihydrothianaphthene [corrected] as a high-affinity ligand for the alpha(2D) adrenergic receptor. J Med Chem 43:765-8 (2000)  
Target
Name:
Alpha-1A/Alpha-1B/Alpha-1D adrenergic receptor
Synonyms:
Adrenergic receptor alpha-1 alpha-1 Adrenergic Receptor
Type:
Mol. Mass.:
Description:
ASSAY_ID of EBI is 303470
Components:
This complex has 3 components.
Component 1
Name:
Alpha-1B adrenergic receptor
Synonyms:
ADA1B_RAT Alpha 1B-adrenoceptor Alpha adrenergic receptor 1A and 1B Alpha-1Adrenoceptor Alpha-1B adrenoreceptor | adrenergic Alpha1B
Type:
G Protein-Coupled Receptor (GPCR)
Mol. Mass.:
56606.71
Organism:
Rattus norvegicus (rat)
Description:
Receptor binding assays were performed using rat cortical membranes.
Residue:
515
  
Component 2
Name:
Alpha-1A adrenergic receptor
Synonyms:
ADA1A_RAT Adra1c Alpha-1A adrenoceptor Alpha-1C adrenergic receptor | adrenergic Alpha1A
Type:
Protein
Mol. Mass.:
51620.15
Organism:
Rattus norvegicus (Rat)
Description:
P43140
Residue:
466
  
Component 3
Name:
Alpha-1D adrenergic receptor
Synonyms:
ADA1D_RAT Adra1d Alpha-1D adrenergic receptor | Serotonin 1a (5-HT1a) receptor/Adrenergic receptor alpha-1
Type:
Protein
Mol. Mass.:
59375.97
Organism:
Rattus norvegicus (Rat)
Description:
P23944
Residue:
561
  
Inhibitor
Name:
BDBM50085676
Synonyms:
4-(1,3-Dimethyl-4,5,6,7-tetrahydro-benzo[c]thiophen-4-yl)-1H-imidazole | CHEMBL30739
Type:
Small organic molecule
Emp. Form.:
C13H16N2S
Mol. Mass.:
232.345
SMILES:
Cc1sc(C)c2C(CCCc12)c1cnc[nH]1
: