Target
Gonadotropin-releasing hormone receptor
Ligand
BDBM50085810
Substrate
Meas. Tech.
ChEMBL_71744 (CHEMBL680266)
Ki
0.26±n/a nM
Citation
 Rivier, JEJiang, GStruthers, RSKoerber, SCPorter, JCervini, LAKirby, DACraig, AGRivier, CL Design of potent dicyclic (1-5/4-10) gonadotropin releasing hormone (GnRH) antagonists. J Med Chem 43:807-18 (2000)  
Target
Name:
Gonadotropin-releasing hormone receptor
Synonyms:
GNRHR_RAT GnRH-R | Gnrhr
Type:
PROTEIN
Mol. Mass.:
37767.60
Organism:
Rattus norvegicus
Description:
ChEMBL_1335047
Residue:
327
  
Inhibitor
Name:
BDBM50085810
Synonyms:
CHEMBL406809 | Gonadotropin Releasing Hormone analogue
Type:
Small organic molecule
Emp. Form.:
C70H90ClN17O13
Mol. Mass.:
1413.023
SMILES:
CC(C)C[C@H]1NC(=O)[C@@H](Cc2ccc3ccccc3c2)NC(=O)[C@H]2CCCCNC(=O)CC[C@@H](NC(C)=O)C(=O)N[C@@H](Cc3ccc(Cl)cc3)C(=O)N[C@H](Cc3c[nH]c4ccccc34)C(=O)N[C@H](CC(=O)NC[C@@H](NC(=O)[C@H]3CCCN3C(=O)[C@H](CCCNC(N)=N)NC1=O)C(N)=O)C(=O)N2
: