Target
Protein kinase C alpha type
Ligand
BDBM50085899
Substrate
Meas. Tech.
ChEMBL_161416 (CHEMBL766516)
Ki
7.3±n/a nM
Citation
 Nacro, KBienfait, BLee, JHan, KCKang, JHBenzaria, SLewin, NEBhattacharyya, DKBlumberg, PMMarquez, VE Conformationally constrained analogues of diacylglycerol (DAG). 16. How much structural complexity is necessary for recognition and high binding affinity to protein kinase C? J Med Chem 43:921-44 (2000)  
Target
Name:
Protein kinase C alpha type
Synonyms:
KPCA_HUMAN PKC alpha and beta-2 PKC-alpha PRKACA Protein Kinase C- alpha Protein kinase C alpha (PKCa) Protein kinase C alpha type (PRKCA) RAF proto-oncogene serine/threonine-protein kinase
Type:
Enzyme
Mol. Mass.:
76755.65
Organism:
Homo sapiens (Human)
Description:
The recombinant human PKC enzymes were produced using a baculovirus expression system in SF9 cells
Residue:
672
  
Inhibitor
Name:
BDBM50085899
Synonyms:
3-Isopropyl-4-methyl-pentanoic acid 4-hexylidene-2-hydroxymethyl-5-oxo-tetrahydro-furan-2-ylmethyl ester | CHEMBL425676
Type:
Small organic molecule
Emp. Form.:
C21H36O5
Mol. Mass.:
368.5075
SMILES:
CCCCC\C=C1\CC(CO)(COC(=O)CC(C(C)C)C(C)C)OC1=O
: