Target
Protein kinase C alpha type
Ligand
BDBM50085879
Substrate
Meas. Tech.
ChEMBL_161416 (CHEMBL766516)
Ki
12±n/a nM
Citation
 Nacro, KBienfait, BLee, JHan, KCKang, JHBenzaria, SLewin, NEBhattacharyya, DKBlumberg, PMMarquez, VE Conformationally constrained analogues of diacylglycerol (DAG). 16. How much structural complexity is necessary for recognition and high binding affinity to protein kinase C? J Med Chem 43:921-44 (2000)  
Target
Name:
Protein kinase C alpha type
Synonyms:
KPCA_HUMAN PKC alpha and beta-2 PKC-alpha PRKACA Protein Kinase C- alpha Protein kinase C alpha (PKCa) Protein kinase C alpha type (PRKCA) RAF proto-oncogene serine/threonine-protein kinase
Type:
Enzyme
Mol. Mass.:
76755.65
Organism:
Homo sapiens (Human)
Description:
The recombinant human PKC enzymes were produced using a baculovirus expression system in SF9 cells
Residue:
672
  
Inhibitor
Name:
BDBM50085879
Synonyms:
CHEMBL172715 | Hexanoic acid 2-hydroxymethyl-4-(3-isopropyl-4-methyl-pent-2-enylidene)-5-oxo-tetrahydro-furan-2-ylmethyl ester
Type:
Small organic molecule
Emp. Form.:
C21H34O5
Mol. Mass.:
366.4917
SMILES:
[#6]-[#6]-[#6]-[#6]-[#6]-[#6](=O)-[#8]-[#6]C1([#6]-[#8])[#6]\[#6](=[#6]\[#6]=[#6](/[#6](-[#6])-[#6])-[#6](-[#6])-[#6])-[#6](=O)-[#8]1
: