Target
Protein kinase C alpha type
Ligand
BDBM50085882
Substrate
Meas. Tech.
ChEMBL_161416 (CHEMBL766516)
Ki
19±n/a nM
Citation
 Nacro, KBienfait, BLee, JHan, KCKang, JHBenzaria, SLewin, NEBhattacharyya, DKBlumberg, PMMarquez, VE Conformationally constrained analogues of diacylglycerol (DAG). 16. How much structural complexity is necessary for recognition and high binding affinity to protein kinase C? J Med Chem 43:921-44 (2000)  
Target
Name:
Protein kinase C alpha type
Synonyms:
KPCA_HUMAN PKC alpha and beta-2 PKC-alpha PRKACA Protein Kinase C- alpha Protein kinase C alpha (PKCa) Protein kinase C alpha type (PRKCA) RAF proto-oncogene serine/threonine-protein kinase
Type:
Enzyme
Mol. Mass.:
76755.65
Organism:
Homo sapiens (Human)
Description:
The recombinant human PKC enzymes were produced using a baculovirus expression system in SF9 cells
Residue:
672
  
Inhibitor
Name:
BDBM50085882
Synonyms:
Butyric acid 2-hydroxymethyl-4-(3-isopropyl-4-methyl-pentylidene)-5-oxo-tetrahydro-furan-2-ylmethyl ester | CHEMBL170464
Type:
Small organic molecule
Emp. Form.:
C19H32O5
Mol. Mass.:
340.4544
SMILES:
CCCC(=O)OCC1(CO)C\C(=C\CC(C(C)C)C(C)C)C(=O)O1
: