Target
Baculoviral IAP repeat-containing protein 3
Ligand
BDBM50393505
Substrate
Meas. Tech.
ChEMBL_1913450 (CHEMBL4416033)
IC50
133±n/a nM
Citation
 Baggio, CUdompholkul, PGambini, LSalem, AFJossart, JPerry, JJPPellecchia, M Aryl-fluorosulfate-based Lysine Covalent Pan-Inhibitors of Apoptosis Protein (IAP) Antagonists with Cellular Efficacy. J Med Chem 62:9188-9200 (2019)  
Target
Name:
Baculoviral IAP repeat-containing protein 3
Synonyms:
API2 BIRC3_HUMAN Baculoviral IAP repeat-containing protein 3 (IAP1 BIR3) MIHC XIAP-BIR3 | cIAP1/cIAP2
Type:
Protein
Mol. Mass.:
68365.75
Organism:
Homo sapiens (Human)
Description:
Q13489
Residue:
604
  
Inhibitor
Name:
BDBM50393505
Synonyms:
CHEMBL2158051
Type:
Small organic molecule
Emp. Form.:
C32H43N5O4
Mol. Mass.:
561.7149
SMILES:
CN[C@@H](C)C(=O)N[C@H]1CN(CC[C@H]2CC[C@H](N2C1=O)C(=O)NC(c1ccccc1)c1ccccc1)C(=O)CC(C)C
: