Target
Adenosine receptor A2a
Ligand
BDBM50021085
Substrate
Meas. Tech.
ChEMBL_30015 (CHEMBL641306)
Ki
63.3±n/a nM
Citation
 Kim, YCJi, XMelman, NLinden, JJacobson, KA Anilide derivatives of an 8-phenylxanthine carboxylic congener are highly potent and selective antagonists at human A(2B) adenosine receptors. J Med Chem 43:1165-72 (2000)  
Target
Name:
Adenosine receptor A2a
Synonyms:
AA2AR_RAT Adenosine A2 receptor Adenosine Receptors A2a (A2a) Adenosine receptors A2a Rat striatal adenosine A2a receptor
Type:
G Protein-Coupled Receptor (GPCR)
Mol. Mass.:
45015.65
Organism:
Rattus norvegicus (rat)
Description:
Rat A2A receptors expressed in CHO cells.
Residue:
410
  
Inhibitor
Name:
BDBM50021085
Synonyms:
2-[4-(2,6-Dioxo-1,3-dipropyl-2,3,6,7-tetrahydro-1H-purin-8-yl)-phenoxy]-N-(4-hydroxy-phenyl)-acetamide CHEMBL444281
Type:
Small organic molecule
Emp. Form.:
C25H27N5O5
Mol. Mass.:
477.5124
SMILES:
CCCn1c2nc([nH]c2c(=O)n(CCC)c1=O)-c1ccc(OCC(=O)Nc2ccc(O)cc2)cc1
: