Target
Histone deacetylase 6
Ligand
BDBM139295
Substrate
Meas. Tech.
ChEMBL_1914364 (CHEMBL4416947)
IC50
2.0±n/a nM
Citation
 Vergani, BSandrone, GMarchini, MRipamonti, CCellupica, EGalbiati, ECaprini, GPavich, GPorro, GRocchio, ILattanzio, MPezzuto, MSkorupska, MCordella, PPagani, PPozzi, PPomarico, RModena, DLeoni, FPerego, RFossati, GSteinkühler, CStevenazzi, A Novel Benzohydroxamate-Based Potent and Selective Histone Deacetylase 6 (HDAC6) Inhibitors Bearing a Pentaheterocyclic Scaffold: Design, Synthesis, and Biological Evaluation. J Med Chem 62:10711-10739 (2019)  
Target
Name:
Histone deacetylase 6
Synonyms:
Cereblon/Histone deacetylase 6 HDAC6 Histone deacetylase 6 (HDAC6) KIAA0901 | ORF Names:JM21
Type:
Chromatin regulator; hydrolase; repressor
Mol. Mass.:
131381.51
Organism:
Homo sapiens (Human)
Description:
Q9UBN7
Residue:
1215
  
Inhibitor
Name:
BDBM139295
Synonyms:
US10858323, Compound 1 | US8614223, 73
Type:
Small organic molecule
Emp. Form.:
C14H14N4O2
Mol. Mass.:
270.2866
SMILES:
ONC(=O)c1cnc(NC2(CC2)c2ccccc2)nc1
: