Target
Receptor-type tyrosine-protein phosphatase mu
Ligand
BDBM50263036
Substrate
Meas. Tech.
ChEMBL_1914769 (CHEMBL4417352)
IC50
>100000±n/a nM
Citation
 McCullough, BSBatsomboon, PHutchinson, KBDudley, GBBarrios, AM Synthesis and PTP Inhibitory Activity of Illudalic Acid and Its Methyl Ether, with Insights into Selectivity for LAR PTP over Other Tyrosine Phosphatases under Physiologically Relevant Conditions. J Nat Prod 82:3386-3393 (2019)  
Target
Name:
Receptor-type tyrosine-protein phosphatase mu
Synonyms:
PTPRL1 PTPRM_HUMAN Receptor-type tyrosine-protein phosphatase mu | Receptor-type tyrosine-protein phosphatase mu (PTPμ)
Type:
Protein
Mol. Mass.:
163683.56
Organism:
Homo sapiens (Human)
Description:
P28827
Residue:
1452
  
Inhibitor
Name:
BDBM50263036
Synonyms:
3-Hydroxy-6-methoxy-8,8-dimethyl-1-oxo-1,3,4,7,8,9-hexahydro-cyclopenta[h]isochromene-5-carbaldehyde | CHEMBL518277
Type:
Small organic molecule
Emp. Form.:
C16H18O5
Mol. Mass.:
290.3111
SMILES:
COc1c2CC(C)(C)Cc2c2C(=O)OC(O)Cc2c1C=O
: