Target
Receptor-type tyrosine-protein phosphatase mu
Ligand
BDBM50262987
Substrate
Meas. Tech.
ChEMBL_1914769 (CHEMBL4417352)
IC50
16000±n/a nM
Citation
 McCullough, BSBatsomboon, PHutchinson, KBDudley, GBBarrios, AM Synthesis and PTP Inhibitory Activity of Illudalic Acid and Its Methyl Ether, with Insights into Selectivity for LAR PTP over Other Tyrosine Phosphatases under Physiologically Relevant Conditions. J Nat Prod 82:3386-3393 (2019)  
Target
Name:
Receptor-type tyrosine-protein phosphatase mu
Synonyms:
PTPRL1 PTPRM_HUMAN Receptor-type tyrosine-protein phosphatase mu | Receptor-type tyrosine-protein phosphatase mu (PTPμ)
Type:
Protein
Mol. Mass.:
163683.56
Organism:
Homo sapiens (Human)
Description:
P28827
Residue:
1452
  
Inhibitor
Name:
BDBM50262987
Synonyms:
CHEMBL506661 | Illudalic acid
Type:
Small organic molecule
Emp. Form.:
C15H16O5
Mol. Mass.:
276.2845
SMILES:
CC1(C)Cc2c(C1)c1C(=O)OC(O)Cc1c(C=O)c2O
: